BDBM451155 US10676499, Example 49
SMILES Cc1ccccc1-c1ccc(C[n+]2cn([C@H]3O[C@@H](COP(O)(O)=O)[C@H](O)[C@@H]3O)c3nc(N)nc([O-])c23)cc1
InChI Key InChIKey=QEHXAKATIKLRPG-UDSSINMLSA-N
Data  1 KI  1 Kd
  Tab Delimited (TSV)   2D SDfile   Computed 3D by Vconf -m prep SDfile
Find this compound or compounds like it in BindingDB:
Activity Spreadsheet -- Enzyme Inhibition Constant Data from BindingDB
Found 2 hits for monomerid = 451155
TargetEukaryotic translation initiation factor 4E(Homo sapiens (Human))
Novartis
US Patent
LigandPNGBDBM451155(US10676499, Example 49)
Affinity DataKi:  20nM. Assay description: Dual histidine and Avi tagged human EIF4E (His6-3C-avi-eIF4E) was expressed in 8 L of TB Media. Induction by 0.4 mM IPTG occurred at 2.0 OD600, and c...
Ligand InfoPC cidPC sid
In DepthDetails US Patent
TargetEukaryotic translation initiation factor 4E(Homo sapiens (Human))
Novartis
US Patent
LigandPNGBDBM451155(US10676499, Example 49)
Affinity DataKd:  6.50E+3nM. Assay description: A subset of compounds was further characterized to determine dissociation constants using thermodynamic (Steady State Affinity) binding analysis.
Ligand InfoPC cidPC sid
In DepthDetails US Patent