BDBM456470 US10723742, Example 196::US11510915, Example 196
SMILES CC(C)(O)Cn1ccc2cc(c(F)c(F)c12)-c1ccc(cc1-c1ccc(C#N)c(F)c1)C(=O)N1[C@@H]2CC[C@H]1[C@@H](N)C2
InChI Key InChIKey=SVBQWYCCYXTCRN-AIGMYPEUSA-N
Data  2 IC50
  Tab Delimited (TSV)   2D SDfile   Computed 3D by Vconf -m prep SDfile
Find this compound or compounds like it in BindingDB:
Activity Spreadsheet -- Enzyme Inhibition Constant Data from BindingDB
Found 2 hits for monomerid = 456470
TargetLysine-specific histone demethylase 1A(Homo sapiens (Human))
Taiho Pharmaceutical
US Patent
LigandPNGBDBM456470(US10723742, Example 196 | US11510915, Example 196)
Affinity DataIC50:  0.140nM. Assay description: The conditions for measuring inhibitory activity of compounds against LSD1 activity were determined with reference to a document available from the w...
Ligand InfoPC cidPC sid
In DepthDetails US Patent
TargetLysine-specific histone demethylase 1A(Homo sapiens (Human))
Taiho Pharmaceutical
US Patent
LigandPNGBDBM456470(US10723742, Example 196 | US11510915, Example 196)
Affinity DataIC50:  0.140nM. Assay description: The conditions for measuring inhibitory activity of compounds against LSD1 activity were determined with reference to a document available from the w...
Ligand InfoPC cidPC sid
In DepthDetails US Patent