BDBM45750 4-(3-oxidanylidene-1,2-benzothiazol-2-yl)-N-(phenylmethyl)benzamide::4-(3-oxo-1,2-benzothiazol-2-yl)-N-(phenylmethyl)benzamide::AB00540079::N-benzyl-4-(3-keto-1,2-benzothiazol-2-yl)benzamide::N-benzyl-4-(3-oxo-1,2-benzothiazol-2-yl)benzamide::cid_16749974
SMILES O=C(NCc1ccccc1)c1ccc(cc1)-n1sc2ccccc2c1=O
InChI Key InChIKey=DYGUVFFVBFETJZ-UHFFFAOYSA-N
Data  1 IC50
  Tab Delimited (TSV)   2D SDfile   Computed 3D by Vconf -m prep SDfile
Find this compound or compounds like it in BindingDB:
Activity Spreadsheet -- Enzyme Inhibition Constant Data from BindingDB
Found 1 hit for monomerid = 45750
TargetDiphosphomevalonate decarboxylase(Streptococcus pneumoniae D39)
Srmlsc
Curated by PubChem BioAssay
LigandPNGBDBM45750(4-(3-oxidanylidene-1,2-benzothiazol-2-yl)-N-(pheny...)
Affinity DataIC50:  734nM. Assay description: Southern Research Molecular Libraries Screening Center (SRMLSC) Southern Research Institute (Birmingham, Alabama) NIH Molecular Libraries Screening...
In DepthDetails PCBioAssay