BDBM459412 US10759813, Example 19-17
SMILES COc1ccccc1-c1ccc(C[C@H](C[C@@H](O)C(O)=O)NC(=O)c2cn(O)nn2)cc1
InChI Key InChIKey=QKKATEWVRNNXDK-CRAIPNDOSA-N
Data  1 KI
  Tab Delimited (TSV)   2D SDfile   Computed 3D by Vconf -m prep SDfile
Find this compound or compounds like it in BindingDB:
Activity Spreadsheet -- Enzyme Inhibition Constant Data from BindingDB
Found 1 hit for monomerid = 459412
TargetNeprilysin(Homo sapiens (Human))
Theravance Biopharma R&D Ip
US Patent
LigandPNGBDBM459412(US10759813, Example 19-17)
Affinity DataKi: <1nM. Assay description: The assays were performed in 384-well white opaque plates at 37° C. using the fluorogenic peptide substrates at a concentration of 10 μM in Assa...
Ligand InfoKEGGPC cidPC sid
In DepthDetails US Patent