BDBM459413 US10759813, Example 19-18
SMILES CC(=O)OCOn1nncc1C(=O)N[C@@H](C[C@@H](O)C(O)=O)Cc1ccc(cc1)-c1cc(Cl)ccc1F
InChI Key InChIKey=GBCGQWCQQDTTDW-DYESRHJHSA-N
Data  1 KI
  Tab Delimited (TSV)   2D SDfile   Computed 3D by Vconf -m prep SDfile
Find this compound or compounds like it in BindingDB:
Activity Spreadsheet -- Enzyme Inhibition Constant Data from BindingDB
Found 1 hit for monomerid = 459413
TargetNeprilysin(Homo sapiens (Human))
Theravance Biopharma R&D Ip
US Patent
LigandPNGBDBM459413(US10759813, Example 19-18)
Affinity DataKi: <1nM. Assay description: The assays were performed in 384-well white opaque plates at 37° C. using the fluorogenic peptide substrates at a concentration of 10 μM in Assa...
Ligand InfoKEGGPC cidPC sid
In DepthDetails US Patent