BDBM459419 US10759813, Example 20-3
SMILES O[C@H](C[C@@H](Cc1ccc(cc1Cl)-c1ccccc1)NC(=O)c1nn(-c2cccc(Cl)c2)c(=O)[nH]1)C(O)=O
InChI Key InChIKey=CYWFXSVERCTNMW-DENIHFKCSA-N
Data  1 KI
  Tab Delimited (TSV)   2D SDfile   Computed 3D by Vconf -m prep SDfile
Find this compound or compounds like it in BindingDB:
Activity Spreadsheet -- Enzyme Inhibition Constant Data from BindingDB
Found 1 hit for monomerid = 459419
TargetNeprilysin(Homo sapiens (Human))
Theravance Biopharma R&D Ip
US Patent
LigandPNGBDBM459419(US10759813, Example 20-3)
Affinity DataKi: <1nM. Assay description: The assays were performed in 384-well white opaque plates at 37° C. using the fluorogenic peptide substrates at a concentration of 10 μM in Assa...
Ligand InfoKEGGPC cidPC sid
In DepthDetails US Patent