BDBM459428 (2R,4R)-5-(5′-Chloro-2′-fluorobiphenyl-4-yl)-2-hydroxy-4-[(3-hydroxy-3H-benzotriazole-5-carbonyl)-amino]-pentanoic Acid::US10759813, Example 22
SMILES O[C@H](C[C@@H](Cc1ccc(cc1)-c1cc(Cl)ccc1F)NC(=O)c1ccc2nnn(O)c2c1)C(O)=O
InChI Key InChIKey=VRIFOZXBORJFQY-VGOFRKELSA-N
Data  1 KI
  Tab Delimited (TSV)   2D SDfile   Computed 3D by Vconf -m prep SDfile
Find this compound or compounds like it in BindingDB:
Activity Spreadsheet -- Enzyme Inhibition Constant Data from BindingDB
Found 1 hit for monomerid = 459428
TargetNeprilysin(Homo sapiens (Human))
Theravance Biopharma R&D Ip
US Patent
LigandPNGBDBM459428((2R,4R)-5-(5′-Chloro-2′-fluorobiphenyl...)
Affinity DataKi: <1nM. Assay description: The assays were performed in 384-well white opaque plates at 37° C. using the fluorogenic peptide substrates at a concentration of 10 μM in Assa...
Ligand InfoKEGGPC cidPC sid
In DepthDetails US Patent