BDBM459434 5-[(S)-2-Biphenyl-4-yl-1-((R)-2-carboxy-2-hydroxy-ethyl)-2-methyl-propylcarbamoyl]-1H-pyrazole-3-carboxylic Acid::US10759813, Example 24
SMILES CC(C)([C@H](C[C@@H](O)C(O)=O)NC(=O)c1cc(n[nH]1)C(O)=O)c1ccc(cc1)-c1ccccc1
InChI Key
Data  1 KI
  Tab Delimited (TSV)   2D SDfile   Computed 3D by Vconf -m prep SDfile
Find this compound or compounds like it in BindingDB:
Activity Spreadsheet -- Enzyme Inhibition Constant Data from BindingDB
Found 1 hit for monomerid = 459434
TargetNeprilysin(Homo sapiens (Human))
Theravance Biopharma R&D Ip
US Patent
LigandPNGBDBM459434(5-[(S)-2-Biphenyl-4-yl-1-((R)-2-carboxy-2-hydroxy-...)
Affinity DataKi: <1nM. Assay description: The assays were performed in 384-well white opaque plates at 37° C. using the fluorogenic peptide substrates at a concentration of 10 μM in Assa...
Ligand InfoKEGGPC cidPC sid
In DepthDetails US Patent