BDBM459437 US10759813, Example 25-3
SMILES CC(C)([C@H](C[C@@H](O)C(O)=O)NC(=O)c1cc(O)no1)c1ccc(cc1)-c1ccccc1
InChI Key InChIKey=FBFDJXQMWQXVPF-MJGOQNOKSA-N
Data  1 KI
  Tab Delimited (TSV)   2D SDfile   Computed 3D by Vconf -m prep SDfile
Find this compound or compounds like it in BindingDB:
Activity Spreadsheet -- Enzyme Inhibition Constant Data from BindingDB
Found 1 hit for monomerid = 459437
TargetNeprilysin(Homo sapiens (Human))
Theravance Biopharma R&D Ip
US Patent
LigandPNGBDBM459437(US10759813, Example 25-3)
Affinity DataKi: <1nM. Assay description: The assays were performed in 384-well white opaque plates at 37° C. using the fluorogenic peptide substrates at a concentration of 10 μM in Assa...
Ligand InfoKEGGPC cidPC sid
In DepthDetails US Patent