BDBM46051 1-(3,4-dihydroxyphenyl)-2-(1,2,4-triazol-4-yl)ethanone;hydrochloride::1-[3,4-bis(oxidanyl)phenyl]-2-(1,2,4-triazol-4-yl)ethanone;hydrochloride::CHEMBL602448::MLS-0315850.0001::cid_25067487
SMILES Oc1ccc(cc1O)C(=O)Cn1cnnc1
InChI Key InChIKey=QXLDHJYXCUEFRK-UHFFFAOYSA-N
Data  4 IC50
  Tab Delimited (TSV)   2D SDfile   Computed 3D by Vconf -m prep SDfile
Find this compound or compounds like it in BindingDB:
Activity Spreadsheet -- Enzyme Inhibition Constant Data from BindingDB
Found 4 hits for monomerid = 46051
TargetAlkaline phosphatase, tissue-nonspecific isozyme(Homo sapiens (Human))
Burnham Center For Chemical Genomics
Curated by PubChem BioAssay
LigandPNGBDBM46051(1-(3,4-dihydroxyphenyl)-2-(1,2,4-triazol-4-yl)etha...)
Affinity DataIC50: >1.00E+5nM. Assay description: Sanford-Burnham Center for Chemical Genomics (SBCCG) Sanford-Burnham Medical Research Institute (SBMRI, San Diego, CA) NIH Molecular Libraries Screen...
In DepthDetails PCBioAssay
TargetAlkaline phosphatase, tissue-nonspecific isozyme(Homo sapiens (Human))
Burnham Center For Chemical Genomics
Curated by PubChem BioAssay
LigandPNGBDBM46051(1-(3,4-dihydroxyphenyl)-2-(1,2,4-triazol-4-yl)etha...)
Affinity DataIC50: >1.00E+5nM. Assay description: Inhibition of TNAP by analogous luminescence assay
In DepthDetails ArticlePubMed
TargetPhospholipase A-2-activating protein(Homo sapiens (Human))
Human Biomolecular Research Institute
Curated by ChEMBL
LigandPNGBDBM46051(1-(3,4-dihydroxyphenyl)-2-(1,2,4-triazol-4-yl)etha...)
Affinity DataIC50:  1.34E+4nM. Assay description: Inhibition of PLAP by analogous luminescence assay
In DepthDetails ArticlePubMed
TargetAlkaline phosphatase, germ cell type(Homo sapiens (Human))
Burnham Center For Chemical Genomics
Curated by PubChem BioAssay
LigandPNGBDBM46051(1-(3,4-dihydroxyphenyl)-2-(1,2,4-triazol-4-yl)etha...)
Affinity DataIC50:  1.34E+4nM. Assay description: Data Source: Sanford-Burnham Center for Chemical Genomics (SBCCG) Source Affiliation: Sanford-Burnham Medical Research Institute (SBMRI, San Diego, C...
In DepthDetails PCBioAssay