BDBM46079 2-(4-fluorophenyl)-1,2-benzothiazol-3-one::MLS-0390876.0001::cid_22416276
SMILES Fc1ccc(cc1)-n1sc2ccccc2c1=O
InChI Key InChIKey=LFFVVGVBSRSFRK-UHFFFAOYSA-N
Data  11 IC50  1 EC50
  Tab Delimited (TSV)   2D SDfile   Computed 3D by Vconf -m prep SDfile
Find this compound or compounds like it in BindingDB:
Activity Spreadsheet -- Enzyme Inhibition Constant Data from BindingDB
Found 12 hits for monomerid = 46079
TargetAlkaline phosphatase, tissue-nonspecific isozyme(Homo sapiens (Human))
Burnham Center For Chemical Genomics
Curated by PubChem BioAssay
LigandPNGBDBM46079(2-(4-fluorophenyl)-1,2-benzothiazol-3-one | MLS-03...)
Affinity DataIC50: >1.00E+5nM. Assay description: Sanford-Burnham Center for Chemical Genomics (SBCCG) Sanford-Burnham Medical Research Institute (SBMRI, San Diego, CA) NIH Molecular Libraries Screen...
In DepthDetails PCBioAssay
TargetPhosphomannomutase 2(Homo sapiens (Human))
Burnham Center For Chemical Genomics
Curated by PubChem BioAssay
LigandPNGBDBM46079(2-(4-fluorophenyl)-1,2-benzothiazol-3-one | MLS-03...)
Affinity DataIC50:  1.81E+4nM. Assay description: Data Source: Sanford-Burnham Center for Chemical Genomics (SBCCG) Source Affiliation: Sanford-Burnham Medical Research Institute (SBMRI, San Diego, C...
In DepthDetails PCBioAssay
TargetPhosphoethanolamine/phosphocholine phosphatase(Homo sapiens (Human))
Burnham Center For Chemical Genomics
Curated by PubChem BioAssay
LigandPNGBDBM46079(2-(4-fluorophenyl)-1,2-benzothiazol-3-one | MLS-03...)
Affinity DataIC50:  4.85E+3nM. Assay description: Data Source: Sanford-Burnham Center for Chemical Genomics (SBCCG) Source Affiliation: Sanford-Burnham Medical Research Institute (SBMRI, San Diego, C...
In DepthDetails PCBioAssay
TargetMannose-6-phosphate isomerase(Homo sapiens (Human))
Burnham Center For Chemical Genomics
Curated by PubChem BioAssay
LigandPNGBDBM46079(2-(4-fluorophenyl)-1,2-benzothiazol-3-one | MLS-03...)
Affinity DataIC50:  1.49E+3nM. Assay description: Data Source: Sanford-Burnham Center for Chemical Genomics (SBCCG) Source Affiliation: Sanford-Burnham Medical Research Institute (SBMRI, San Diego, C...
In DepthDetails PCBioAssay
TargetDNA dC->dU-editing enzyme APOBEC-3G(Homo sapiens (Human))
Burnham Center For Chemical Genomics
Curated by PubChem BioAssay
LigandPNGBDBM46079(2-(4-fluorophenyl)-1,2-benzothiazol-3-one | MLS-03...)
Affinity DataIC50:  1.24E+4nMT: 2°C. Assay description: Data Source: Sanford-Burnham Center for Chemical Genomics (SBCCG) Source Affiliation: Sanford-Burnham Medical Research Institute (SBMRI, San Diego, C...
In DepthDetails PCBioAssay
TargetMannose-6-phosphate isomerase(Homo sapiens (Human))
Burnham Center For Chemical Genomics
Curated by PubChem BioAssay
LigandPNGBDBM46079(2-(4-fluorophenyl)-1,2-benzothiazol-3-one | MLS-03...)
Affinity DataIC50:  3.40E+3nM. Assay description: Inhibition of phosphomannose isomerase (unknown origin)
In DepthDetails ArticlePubMed
TargetMitochondrial peptide methionine sulfoxide reductase(Bos taurus)
The Scripps Research Institute Molecular Screening Center
Curated by PubChem BioAssay
LigandPNGBDBM46079(2-(4-fluorophenyl)-1,2-benzothiazol-3-one | MLS-03...)
Affinity DataEC50:  9.85E+4nM. Assay description: Source (MLPCN Center Name): The Scripps Research Institute Molecular Screening Center (SRIMSC) Affiliation: The Scripps Research Institute, TSRI Assa...
In DepthDetails PCBioAssay
TargetBeta-lactamase(Pseudomonas aeruginosa)
The Scripps Research Institute Molecular Screening Center
Curated by PubChem BioAssay
LigandPNGBDBM46079(2-(4-fluorophenyl)-1,2-benzothiazol-3-one | MLS-03...)
Affinity DataIC50:  2.95E+4nM
In DepthDetails PCBioAssay
TargetReceptor-interacting serine/threonine-protein kinase 2(Homo sapiens (Human))
The Scripps Research Institute Molecular Screening Center
Curated by PubChem BioAssay
LigandPNGBDBM46079(2-(4-fluorophenyl)-1,2-benzothiazol-3-one | MLS-03...)
Affinity DataIC50:  5.10E+3nM
In DepthDetails PCBioAssay
TargetPhosphoethanolamine/phosphocholine phosphatase(Homo sapiens (Human))
Burnham Center For Chemical Genomics
Curated by PubChem BioAssay
LigandPNGBDBM46079(2-(4-fluorophenyl)-1,2-benzothiazol-3-one | MLS-03...)
Affinity DataIC50:  4.90E+3nM. Assay description: Inhibition of PHOSPHO1 phosphoethanolamine activity (unknown origin) assessed as amount of inorganic phosphate release after 30 mins
In DepthDetails ArticlePubMed
TargetPhosphomannomutase 2(Homo sapiens (Human))
Burnham Center For Chemical Genomics
Curated by PubChem BioAssay
LigandPNGBDBM46079(2-(4-fluorophenyl)-1,2-benzothiazol-3-one | MLS-03...)
Affinity DataIC50: >2.00E+4nM. Assay description: Inhibition of PMM2 (unknown origin)
In DepthDetails ArticlePubMed
TargetDNA dC->dU-editing enzyme APOBEC-3A(Homo sapiens (Human))
Burnham Center For Chemical Genomics
Curated by PubChem BioAssay
LigandPNGBDBM46079(2-(4-fluorophenyl)-1,2-benzothiazol-3-one | MLS-03...)
Affinity DataIC50: >1.00E+5nMT: 2°C. Assay description: Data Source: Sanford-Burnham Center for Chemical Genomics (SBCCG) Source Affiliation: Sanford-Burnham Medical Research Institute (SBMRI, San Diego, C...
In DepthDetails PCBioAssay