BDBM463308 (-)-(2R)-2-Methyl-3- (benzimidazol-4- ylmethylamino)-N-(9-chloro- 3,4-dihydro-2H-1,5- benzodioxepin-7-ylmethyl)-N- isobutylpropanamide::US10780095, Structure TABLE 1.6
SMILES CC(C)CN(Cc1cc(Cl)c2OCCCOc2c1)C(=O)C(C)CNCc1cccc2nc[nH]c12
InChI Key
Data  1 KI
  Tab Delimited (TSV)   2D SDfile   Computed 3D by Vconf -m prep SDfile
Find this compound or compounds like it in BindingDB:
Activity Spreadsheet -- Enzyme Inhibition Constant Data from BindingDB
Found 1 hit for monomerid = 463308
TargetProkineticin receptor 1(Homo sapiens (Human))
The Regents of The University of California
US Patent
LigandPNGBDBM463308((-)-(2R)-2-Methyl-3- (benzimidazol-4- ylmethylamin...)
Affinity DataKi:  3.5nM. Assay description: An aequorin-based luminescent assay for calcium mobilization was used to measure mobilization of intracellular Ca2+ (Bullock et al., Mol Pharmacol 65...
Ligand InfoPC cidPC sid
In DepthDetails US Patent