BDBM463507 3-(4-(Methyl(phenyl)amino)piperidin-1-yl)-2-phenylquinoxaline-6-carboxylic acid::US10781185, Example 35
SMILES COC(=O)c1ccc2nc(-c3ccccc3)c(nc2c1)N1CCC(CC1)Nc1ccccc1
InChI Key InChIKey=YWYXJVLWZYLVQD-UHFFFAOYSA-N
Data  1 IC50
  Tab Delimited (TSV)   2D SDfile   Computed 3D by Vconf -m prep SDfile
Find this compound or compounds like it in BindingDB:
Activity Spreadsheet -- Enzyme Inhibition Constant Data from BindingDB
Found 1 hit for monomerid = 463507
TargetPAS domain-containing serine/threonine-protein kinase(Homo sapiens (Human))
Bioenergenix
US Patent
LigandPNGBDBM463507(3-(4-(Methyl(phenyl)amino)piperidin-1-yl)-2-phenyl...)
Affinity DataIC50: <1.00E+3nM. Assay description: Compound screening was done via the following method. 10 mM stock solution of test compound in DMSO was prepared by dissolving test compound in DMSO ...
Ligand InfoPC cidPC sid
In DepthDetails US Patent