BDBM463541 2-(Benzo[d][1,3]dioxol-5-yl)-3-(3,4-dihydroquinolin-1(2H)-yl)quinoxaline-6-carboxylic acid::US10781185, Example 95::US11459307, Example 95
SMILES OC(=O)c1ccc2nc(-c3ccc4OCOc4c3)c(nc2c1)N1CCCc2ccccc12
InChI Key InChIKey=HLFUXGUPGUREQZ-UHFFFAOYSA-N
Data  2 IC50
  Tab Delimited (TSV)   2D SDfile   Computed 3D by Vconf -m prep SDfile
Find this compound or compounds like it in BindingDB:
Activity Spreadsheet -- Enzyme Inhibition Constant Data from BindingDB
Found 2 hits for monomerid = 463541
TargetPAS domain-containing serine/threonine-protein kinase(Homo sapiens (Human))
Bioenergenix
US Patent
LigandPNGBDBM463541(2-(Benzo[d][1,3]dioxol-5-yl)-3-(3,4-dihydroquinoli...)
Affinity DataIC50: <1.00E+4nM. Assay description: The aim of the FRET assay is to determine the inhibition potential of test compounds on targeted kinase. This assay platform provides a homogenous sc...
Ligand InfoPC cidPC sid
In DepthDetails US Patent
TargetPAS domain-containing serine/threonine-protein kinase(Homo sapiens (Human))
Bioenergenix
US Patent
LigandPNGBDBM463541(2-(Benzo[d][1,3]dioxol-5-yl)-3-(3,4-dihydroquinoli...)
Affinity DataIC50: <1.00E+3nM. Assay description: Compound screening was done via the following method. 10 mM stock solution of test compound in DMSO was prepared by dissolving test compound in DMSO ...
Ligand InfoPC cidPC sid
In DepthDetails US Patent