BDBM463544 US10781185, Example 98::US11459307, Example 98
SMILES CC(C)N(C)c1nc2cc(ccc2nc1-c1ccco1)C(O)=O
InChI Key InChIKey=NYGQXUZKDABDDD-UHFFFAOYSA-N
Data  2 IC50
  Tab Delimited (TSV)   2D SDfile   Computed 3D by Vconf -m prep SDfile
Find this compound or compounds like it in BindingDB:
Activity Spreadsheet -- Enzyme Inhibition Constant Data from BindingDB
Found 2 hits for monomerid = 463544
TargetPAS domain-containing serine/threonine-protein kinase(Homo sapiens (Human))
Bioenergenix
US Patent
LigandPNGBDBM463544(US10781185, Example 98 | US11459307, Example 98)
Affinity DataIC50: <1.00E+4nM. Assay description: The aim of the FRET assay is to determine the inhibition potential of test compounds on targeted kinase. This assay platform provides a homogenous sc...
Ligand InfoPC cidPC sid
In DepthDetails US Patent
TargetPAS domain-containing serine/threonine-protein kinase(Homo sapiens (Human))
Bioenergenix
US Patent
LigandPNGBDBM463544(US10781185, Example 98 | US11459307, Example 98)
Affinity DataIC50: <1.00E+3nM. Assay description: Compound screening was done via the following method. 10 mM stock solution of test compound in DMSO was prepared by dissolving test compound in DMSO ...
Ligand InfoPC cidPC sid
In DepthDetails US Patent