BDBM466372 (8S)-N-[(1S,2S)-2- (5-fluoro-2- pyridyl)-2- hydroxy-1- (hydroxymethyl) ethyl]-5-(7H- pyrrolo[2,3- d]pyrimidin-4-yl)- 5-azaspiro [2.5]octane- 8-carboxamide::US10799507, Example 30
SMILES OC[C@H](NC(=O)[C@H]1CCN(CC11CC1)c1ncnc2[nH]ccc12)[C@H](O)c1ccc(F)cn1
InChI Key
Data  4 EC50
  Tab Delimited (TSV)   2D SDfile   Computed 3D by Vconf -m prep SDfile
Find this compound or compounds like it in BindingDB:
Activity Spreadsheet -- Enzyme Inhibition Constant Data from BindingDB
Found 4 hits for monomerid = 466372
TargetTyrosine-protein kinase JAK1(Homo sapiens (Human))
Leo Pharma
US Patent
LigandPNGBDBM466372((8S)-N-[(1S,2S)-2- (5-fluoro-2- pyridyl)-2- hydrox...)
Affinity DataEC50:  1.40nM. Assay description: Human baculovirus-expressed JAK1, 2, 3 and TYK2 were purchased from Carna Biosciences, Inc. All four purified enzymes contain only the catalytic doma...
Ligand InfoPC cidPC sid
In DepthDetails US Patent
TargetNon-receptor tyrosine-protein kinase TYK2(Homo sapiens (Human))
Leo Pharma
US Patent
LigandPNGBDBM466372((8S)-N-[(1S,2S)-2- (5-fluoro-2- pyridyl)-2- hydrox...)
Affinity DataEC50:  30.5nM. Assay description: Human baculovirus-expressed JAK1, 2, 3 and TYK2 were purchased from Carna Biosciences, Inc. All four purified enzymes contain only the catalytic doma...
Ligand InfoPC cidPC sid
In DepthDetails US Patent
TargetTyrosine-protein kinase JAK3(Homo sapiens (Human))
Leo Pharma
US Patent
LigandPNGBDBM466372((8S)-N-[(1S,2S)-2- (5-fluoro-2- pyridyl)-2- hydrox...)
Affinity DataEC50:  27.1nM. Assay description: Human baculovirus-expressed JAK1, 2, 3 and TYK2 were purchased from Carna Biosciences, Inc. All four purified enzymes contain only the catalytic doma...
Ligand InfoPC cidPC sid
In DepthDetails US Patent
TargetTyrosine-protein kinase JAK2(Homo sapiens (Human))
Leo Pharma
US Patent
LigandPNGBDBM466372((8S)-N-[(1S,2S)-2- (5-fluoro-2- pyridyl)-2- hydrox...)
Affinity DataEC50:  2.40nM. Assay description: Human baculovirus-expressed JAK1, 2, 3 and TYK2 were purchased from Carna Biosciences, Inc. All four purified enzymes contain only the catalytic doma...
Ligand InfoPC cidPC sid
In DepthDetails US Patent