BDBM46877 MLS000530990::N,4-dimethyl-N-(4-methylphenyl)benzenesulfonamide::N,4-dimethyl-N-(p-tolyl)benzenesulfonamide::SMR000135968::cid_800890
SMILES CN(c1ccc(C)cc1)S(=O)(=O)c1ccc(C)cc1
InChI Key InChIKey=AFMKTQHRDBNAKW-UHFFFAOYSA-N
Data  2 EC50
  Tab Delimited (TSV)   2D SDfile   Computed 3D by Vconf -m prep SDfile
Find this compound or compounds like it in BindingDB:
Activity Spreadsheet -- Enzyme Inhibition Constant Data from BindingDB
Found 1 hit for monomerid = 46877
TargetMucolipin-3(Homo sapiens (Human))
The Scripps Research Institute Molecular Screening Center
Curated by PubChem BioAssay
LigandPNGBDBM46877(MLS000530990 | N,4-dimethyl-N-(4-methylphenyl)benz...)
Affinity DataEC50:  5.10E+3nM. Assay description: Source (MLPCN Center Name): The Scripps Research Institute Molecular Screening Center (SRIMSC) Center Affiliation: The Scripps Research Institute (TS...
In DepthDetails PCBioAssay