BDBM4712 3-[(Aminoiminomethyl)amino]-4-[(2-methylpropionyl)amino]benzoic Acid::3-carbamimidamido-4-(2-methylpropanamido)benzoic acid::Benzoic Acid deriv. 149
SMILES [#6]-[#6](-[#6])-[#6](=O)-[#7]-c1ccc(cc1\[#7]=[#6](/[#7])-[#7])-[#6](-[#8])=O
InChI Key InChIKey=IYFYODMNIXXTJJ-UHFFFAOYSA-N
Data  1 IC50
  Tab Delimited (TSV)   2D SDfile   Computed 3D by Vconf -m prep SDfile
Find this compound or compounds like it in BindingDB:
Activity Spreadsheet -- Enzyme Inhibition Constant Data from BindingDB
Found 1 hit for monomerid = 4712
TargetNeuraminidase(Influenza A virus (N9))
Biocryst Pharmaceuticals
LigandPNGBDBM4712(3-[(Aminoiminomethyl)amino]-4-[(2-methylpropionyl)...)
Affinity DataIC50:  1.00E+6nMpH: 6.5 T: 2°C. Assay description: A standard fluorimetric assay was used to measure influenza virus neuraminidase activity. The substrate 2 -(4-methylumbelliferyl)-alpha-D-acetylneura...
In DepthDetails ArticlePubMed