BDBM474008 N-(5-{2-[(1S)-1-Cyclopropylethyl]-7-(oxetan-3-ylsulfamoyl)-1-oxo-2,3- dihydro-1H-isoindol-5-yl}-4-methyl-1,3-thiazol-2-yl)acetamide::US10858355, Example 16
SMILES C[C@@H](C1CC1)N1Cc2cc(cc(c2C1=O)S(=O)(=O)NC1COC1)-c1sc(NC(C)=O)nc1C
InChI Key InChIKey=FJHUMWRTKPAXRM-LBPRGKRZSA-N
Data  1 IC50
  Tab Delimited (TSV)   2D SDfile   Computed 3D by Vconf -m prep SDfile
Find this compound or compounds like it in BindingDB:
Activity Spreadsheet -- Enzyme Inhibition Constant Data from BindingDB
Found 1 hit for monomerid = 474008
LigandPNGBDBM474008(N-(5-{2-[(1S)-1-Cyclopropylethyl]-7-(oxetan-3-ylsu...)
Affinity DataIC50:  0.631nM. Assay description: The activity of recombinant human PI3Kγ (aa144-1102)-6His was determined by measuring the ADP level after phosphorylation of DiC8-PIP2 using a c...
Ligand InfoPC cidPC sid
In DepthDetails US Patent