BDBM476261 US10874675, Example 5
SMILES CC(C)Cn1c2nc(COc3cncc4ccccc34)c(CCCCCO)nc2c(=O)n(C)c1=O
InChI Key InChIKey=XGXCZTIKSVRCFZ-UHFFFAOYSA-N
Data  1 EC50
  Tab Delimited (TSV)   2D SDfile   Computed 3D by Vconf -m prep SDfile
Find this compound or compounds like it in BindingDB:
Activity Spreadsheet -- Enzyme Inhibition Constant Data from BindingDB
Found 1 hit for monomerid = 476261
TargetMalignant T-cell-amplified sequence 1(Homo sapiens (human))
The Scripps Research Institute
US Patent
LigandPNGBDBM476261(US10874675, Example 5)
Affinity DataEC50: <50nM. Assay description: Specific Examples of compounds of the invention, with estimated EC50 values determined using an MTT assay for 4-day viability of Raji (Burkitt's)...
Ligand InfoPC cidPC sid
In DepthDetails US Patent