BDBM478491 2-(4-(1-acryloyl-2,3,6,7-tetrahydro-1H-azepin-4-yl)phenyl)-N-(5-cyclopropyl- 1H-pyrazol-3-yl)propanamide::US10894786, Comp. No 9
SMILES CC(C(=O)Nc1cc([nH]n1)C1CC1)c1ccc(cc1)C1=CCCN(CC1)C(=O)C=C
InChI Key
Data  3 IC50  1 Kd
  Tab Delimited (TSV)   2D SDfile   Computed 3D by Vconf -m prep SDfile
Find this compound or compounds like it in BindingDB:
Activity Spreadsheet -- Enzyme Inhibition Constant Data from BindingDB
Found 4 hits for monomerid = 478491
TargetCyclin-dependent kinase 12(Homo sapiens)
Aurigene Discovery Technologies
US Patent
LigandPNGBDBM478491(2-(4-(1-acryloyl-2,3,6,7-tetrahydro-1H-azepin-4-yl...)
Affinity DataKd:  63nM. Assay description: Kinase-tagged T7 phage strains were grown in parallel in 24-well blocks in an E. coli host derived from the BL21 strain. E. coli were grown to log-ph...
Ligand InfoPC cidPC sid
In DepthDetails US Patent
TargetCyclin-dependent kinase 7(Homo sapiens (Human))
Aurigene Discovery Technologies
US Patent
LigandPNGBDBM478491(2-(4-(1-acryloyl-2,3,6,7-tetrahydro-1H-azepin-4-yl...)
Affinity DataIC50:  6.59E+3nM. Assay description: The inhibitory activity of the test compounds was assessed by the LANCE TR-FRET assay, which detects the ATP-dependent phosphorylation of an ULight-m...
Ligand InfoPC cidPC sid
In DepthDetails US Patent
TargetCyclin-dependent kinase 13(Homo sapiens (Human))
Aurigene Discovery Technologies
US Patent
LigandPNGBDBM478491(2-(4-(1-acryloyl-2,3,6,7-tetrahydro-1H-azepin-4-yl...)
Affinity DataIC50:  21nM. Assay description: LanthaScreen Eu Kinase Binding Assays are based on the binding and displacement of Alexa Fluor 647-labeled, ATP-competitive kinase inhibitor scaffold...
Ligand InfoPC cidPC sid
In DepthDetails US Patent
TargetCyclin-dependent kinase 12(Homo sapiens)
Aurigene Discovery Technologies
US Patent
LigandPNGBDBM478491(2-(4-(1-acryloyl-2,3,6,7-tetrahydro-1H-azepin-4-yl...)
Affinity DataIC50:  240nM. Assay description: The inhibitory activity of the test compounds was assessed by the LANCE TR-FRET assay, which detects the ATP-dependent phosphorylation of an ULight-4...
Ligand InfoPC cidPC sid
In DepthDetails US Patent