BDBM482378 US10919852, Compound TABLE 1.77::US11708326, Compound TABLE 1.77
SMILES OC1CCN(CCCOc2cccc(c2Cl)-c2cccc3[C@H](CCc23)Oc2cc(OCc3cncc(c3)C#N)c(CNCC3CCC(=O)N3)cc2Cl)CC1
InChI Key InChIKey=SMXMESIUBGLCMR-AZPJNPSPSA-N
Data  2 IC50
  Tab Delimited (TSV)   2D SDfile   Computed 3D by Vconf -m prep SDfile
Find this compound or compounds like it in BindingDB:
Activity Spreadsheet -- Enzyme Inhibition Constant Data from BindingDB
Found 2 hits for monomerid = 482378
TargetProgrammed cell death 1 ligand 1(Homo sapiens (Human))
Chemocentryx
US Patent
LigandPNGBDBM482378(US10919852, Compound TABLE 1.77 | US11708326, Comp...)
Affinity DataIC50: <5nM. Assay description: 96 Well plates were coated with 1 μg/mL of human PD-L1 (obtained from R&D) in PBS overnight at 4° C. The wells were then blocked with 2% BSA in ...
Ligand InfoPC cidPC sid
In DepthDetails US Patent
TargetProgrammed cell death protein 1(Homo sapiens)
Chemocentryx
US Patent
LigandPNGBDBM482378(US10919852, Compound TABLE 1.77 | US11708326, Comp...)
Affinity DataIC50: <5nM. Assay description: 96 Well plates were coated with 1 g/mL of human PD-L1 (obtained from R&D) in PBS overnight at 4° C. The wells were then blocked with 2% BSA in PBS (W...
Ligand InfoPC cidPC sid
In DepthDetails US Patent