BDBM482384 US10919852, Compound TABLE 1.83::US11708326, Compound TABLE 1.83
SMILES Cc1c(OCCCN2CCC(O)CC2)cccc1-c1cccc2[C@@H](Oc3cc(OCc4cncc(c4)C#N)c(CN[C@@H]4CCCC[C@@H]4O)cc3Cl)[C@@H](F)Cc12
InChI Key InChIKey=CNKITIKKQUAAQO-VQPHTPOISA-N
Data  2 IC50
  Tab Delimited (TSV)   2D SDfile   Computed 3D by Vconf -m prep SDfile
Find this compound or compounds like it in BindingDB:
Activity Spreadsheet -- Enzyme Inhibition Constant Data from BindingDB
Found 2 hits for monomerid = 482384
TargetProgrammed cell death 1 ligand 1(Homo sapiens (Human))
Chemocentryx
US Patent
LigandPNGBDBM482384(US10919852, Compound TABLE 1.83 | US11708326, Comp...)
Affinity DataIC50: <5nM. Assay description: 96 Well plates were coated with 1 μg/mL of human PD-L1 (obtained from R&D) in PBS overnight at 4° C. The wells were then blocked with 2% BSA in ...
Ligand InfoPC cidPC sid
In DepthDetails US Patent
TargetProgrammed cell death protein 1(Homo sapiens)
Chemocentryx
US Patent
LigandPNGBDBM482384(US10919852, Compound TABLE 1.83 | US11708326, Comp...)
Affinity DataIC50: <5nM. Assay description: 96 Well plates were coated with 1 g/mL of human PD-L1 (obtained from R&D) in PBS overnight at 4° C. The wells were then blocked with 2% BSA in PBS (W...
Ligand InfoPC cidPC sid
In DepthDetails US Patent