BDBM482412 US10919852, Compound TABLE 1.111::US11708326, Compound TABLE 1.111
SMILES O[C@H]1CCCC[C@H]1NCc1cc(Cl)c(O[C@H]2CCc3c2cccc3-c2cccc(OCCCN3CCC(F)CC3)c2Cl)cc1OCc1cncc(c1)C#N
InChI Key InChIKey=UKTRHIYHLFWTBF-VFBMNZBOSA-N
Data  2 IC50
  Tab Delimited (TSV)   2D SDfile   Computed 3D by Vconf -m prep SDfile
Find this compound or compounds like it in BindingDB:
Activity Spreadsheet -- Enzyme Inhibition Constant Data from BindingDB
Found 2 hits for monomerid = 482412
TargetProgrammed cell death 1 ligand 1(Homo sapiens (Human))
Chemocentryx
US Patent
LigandPNGBDBM482412(US10919852, Compound TABLE 1.111 | US11708326, Com...)
Affinity DataIC50: <5nM. Assay description: 96 Well plates were coated with 1 μg/mL of human PD-L1 (obtained from R&D) in PBS overnight at 4° C. The wells were then blocked with 2% BSA in ...
Ligand InfoPC cidPC sid
In DepthDetails US Patent
TargetProgrammed cell death protein 1(Homo sapiens)
Chemocentryx
US Patent
LigandPNGBDBM482412(US10919852, Compound TABLE 1.111 | US11708326, Com...)
Affinity DataIC50: <5nM. Assay description: 96 Well plates were coated with 1 g/mL of human PD-L1 (obtained from R&D) in PBS overnight at 4° C. The wells were then blocked with 2% BSA in PBS (W...
Ligand InfoPC cidPC sid
In DepthDetails US Patent