BDBM482462 US10919852, Compound TABLE 1.161::US11708326, Compound TABLE 1.161
SMILES F[C@@H]1CCN(Cc2cc(Cl)c(O[C@H]3CCc4c3cccc4-c3cccc(OCCCN4CCC(F)CC4)c3Cl)cc2OCc2cncc(c2)C#N)C1
InChI Key InChIKey=FGWOTXVFFFYRCH-XLNFBEDTSA-N
Data  2 IC50
  Tab Delimited (TSV)   2D SDfile   Computed 3D by Vconf -m prep SDfile
Find this compound or compounds like it in BindingDB:
Activity Spreadsheet -- Enzyme Inhibition Constant Data from BindingDB
Found 2 hits for monomerid = 482462
TargetProgrammed cell death 1 ligand 1(Homo sapiens (Human))
Chemocentryx
US Patent
LigandPNGBDBM482462(US10919852, Compound TABLE 1.161 | US11708326, Com...)
Affinity DataIC50: <5nM. Assay description: 96 Well plates were coated with 1 μg/mL of human PD-L1 (obtained from R&D) in PBS overnight at 4° C. The wells were then blocked with 2% BSA in ...
Ligand InfoPC cidPC sid
In DepthDetails US Patent
TargetProgrammed cell death protein 1(Homo sapiens)
Chemocentryx
US Patent
LigandPNGBDBM482462(US10919852, Compound TABLE 1.161 | US11708326, Com...)
Affinity DataIC50: <5nM. Assay description: 96 Well plates were coated with 1 g/mL of human PD-L1 (obtained from R&D) in PBS overnight at 4° C. The wells were then blocked with 2% BSA in PBS (W...
Ligand InfoPC cidPC sid
In DepthDetails US Patent