BDBM487661 N-(5-cyano-6-(2H-1,2,3-triazol- 2-yl)pyridin-3-yl)-1-(quinolin-5- yl)-5-(trifluoromethyl)-1H- pyrazole-4-carboxamide::US10954214, Compound 130::US10954214, Compound 83
SMILES FC(F)(F)c1c(cnn1-c1cccc2ncccc12)C(=O)Nc1cnc(c(c1)C#N)-n1nccn1
InChI Key InChIKey=CFQWTNSHUWQGIN-UHFFFAOYSA-N
Data  2 IC50
  Tab Delimited (TSV)   2D SDfile   Computed 3D by Vconf -m prep SDfile
Find this compound or compounds like it in BindingDB:
Activity Spreadsheet -- Enzyme Inhibition Constant Data from BindingDB
Found 2 hits for monomerid = 487661
TargetMucosa-associated lymphoid tissue lymphoma translocation protein 1(Homo sapiens (Human))
Janssen Pharmaceutica
US Patent
LigandPNGBDBM487661(N-(5-cyano-6-(2H-1,2,3-triazol- 2-yl)pyridin-3-yl)...)
Affinity DataIC50:  17nM. Assay description: MALT1 protease activity was assessed in an in vitro assay using a tetrapeptide as substrate and full-length MALT1 protein (Strep-MALT1(1-824)-His) pu...
Ligand InfoPC cidPC sid
In DepthDetails US Patent
TargetMucosa-associated lymphoid tissue lymphoma translocation protein 1(Homo sapiens (Human))
Janssen Pharmaceutica
US Patent
LigandPNGBDBM487661(N-(5-cyano-6-(2H-1,2,3-triazol- 2-yl)pyridin-3-yl)...)
Affinity DataIC50:  34nM. Assay description: MALT1 protease activity was assessed in an in vitro assay using a tetrapeptide as substrate and full-length MALT1 protein (Strep-MALT1(1-824)-His) pu...
Ligand InfoPC cidPC sid
In DepthDetails US Patent