BDBM487731 1-(benzo[d]thiazol-7-yl)-N-(5- chloro-6-(2H-1,2,3-triazol-2- yl)pyridin-3-yl)-5- (trifluoromethyl)-1H-pyrazole-4- carboxamide::US10954214, Compound 153
SMILES FC(F)(F)c1c(cnn1-c1cccc2ncsc12)C(=O)Nc1cnc(c(Cl)c1)-n1nccn1
InChI Key InChIKey=XJIHBVFIQNICMM-UHFFFAOYSA-N
Data  1 IC50
  Tab Delimited (TSV)   2D SDfile   Computed 3D by Vconf -m prep SDfile
Find this compound or compounds like it in BindingDB:
Activity Spreadsheet -- Enzyme Inhibition Constant Data from BindingDB
Found 1 hit for monomerid = 487731
TargetMucosa-associated lymphoid tissue lymphoma translocation protein 1(Homo sapiens (Human))
Janssen Pharmaceutica
US Patent
LigandPNGBDBM487731(1-(benzo[d]thiazol-7-yl)-N-(5- chloro-6-(2H-1,2,3-...)
Affinity DataIC50:  12nM. Assay description: MALT1 protease activity was assessed in an in vitro assay using a tetrapeptide as substrate and full-length MALT1 protein (Strep-MALT1(1-824)-His) pu...
Ligand InfoPC cidPC sid
In DepthDetails US Patent