BDBM487969 4-(4-((5-chloro-6-(2H-1,2,3- triazol-2-yl)pyridin-3- yl)carbamoyl)-5- (trifluoromethyl)-1H-pyrazol-1- yl)thieno[2,3-c]pyridine-7- carboxamide::US10954214, Compound 391
SMILES NC(=O)c1ncc(-n2ncc(C(=O)Nc3cnc(c(Cl)c3)-n3nccn3)c2C(F)(F)F)c2ccsc12
InChI Key InChIKey=GMKPMPPGJCNIEI-UHFFFAOYSA-N
Data  1 IC50
  Tab Delimited (TSV)   2D SDfile   Computed 3D by Vconf -m prep SDfile
Find this compound or compounds like it in BindingDB:
Activity Spreadsheet -- Enzyme Inhibition Constant Data from BindingDB
Found 1 hit for monomerid = 487969
TargetMucosa-associated lymphoid tissue lymphoma translocation protein 1(Homo sapiens (Human))
Janssen Pharmaceutica
US Patent
LigandPNGBDBM487969(4-(4-((5-chloro-6-(2H-1,2,3- triazol-2-yl)pyridin-...)
Affinity DataIC50:  7nM. Assay description: MALT1 protease activity was assessed in an in vitro assay using a tetrapeptide as substrate and full-length MALT1 protein (Strep-MALT1(1-824)-His) pu...
Ligand InfoPC cidPC sid
In DepthDetails US Patent