BDBM488004 N-(5-chloro-2-methyl-6-(2H- 1,2,3-triazol-2-yl)pyridin-3-yl)- 1-(7-chlorothieno[2,3-c]pyridin- 4-yl)-5-(trifluoromethyl)-1H- pyrazole-4-carboxamide::US10954214, Compound 426
SMILES Cc1nc(c(Cl)cc1NC(=O)c1cnn(c1C(F)(F)F)-c1cnc(Cl)c2sccc12)-n1nccn1
InChI Key InChIKey=CEBFGOOZWADMCI-UHFFFAOYSA-N
Data  1 IC50
  Tab Delimited (TSV)   2D SDfile   Computed 3D by Vconf -m prep SDfile
Find this compound or compounds like it in BindingDB:
Activity Spreadsheet -- Enzyme Inhibition Constant Data from BindingDB
Found 1 hit for monomerid = 488004
TargetMucosa-associated lymphoid tissue lymphoma translocation protein 1(Homo sapiens (Human))
Janssen Pharmaceutica
US Patent
LigandPNGBDBM488004(N-(5-chloro-2-methyl-6-(2H- 1,2,3-triazol-2-yl)pyr...)
Affinity DataIC50:  13nM. Assay description: MALT1 protease activity was assessed in an in vitro assay using a tetrapeptide as substrate and full-length MALT1 protein (Strep-MALT1(1-824)-His) pu...
Ligand InfoPC cidPC sid
In DepthDetails US Patent