BDBM489129 2-(5- (cyclopropylmethyl)- 3-(4-fluoro-3-(p- tolyloxy)phenyl)-4- (3-fluoro-4- sulfamoylbenzyl)- 1H-pyrazol-1- yl)thiazole-4- carboxylic acid;::US10961200, Compound 510::US11247971, Cmpd ID 510
SMILES Cc1ccc(Oc2cc(ccc2F)-c2nn(c(CC3CC3)c2Cc2ccc(c(F)c2)S(N)(=O)=O)-c2nc(cs2)C(O)=O)cc1
InChI Key InChIKey=ALDKACGJYHWHBX-UHFFFAOYSA-N
Data  5 IC50  1 Kd
  Tab Delimited (TSV)   2D SDfile   Computed 3D by Vconf -m prep SDfile
Find this compound or compounds like it in BindingDB:
Activity Spreadsheet -- Enzyme Inhibition Constant Data from BindingDB
Found 6 hits for monomerid = 489129
TargetL-lactate dehydrogenase A chain(Homo sapiens (Human))
The United States of America, As Represented By The Secretary, Department of Health and Human Services
US Patent
LigandPNGBDBM489129(2-(5- (cyclopropylmethyl)- 3-(4-fluoro-3-(p- tolyl...)
Affinity DataIC50: <100nM. Assay description: Test compounds were placed in a Greiner Bio-One (Monroe, N.C.) 1536-well black solid bottom assay plate. 200 millimolar (mM) Tris HCl, pH 7.4, 100 mi...
Ligand InfoPC cidPC sid
In DepthDetails US Patent
TargetL-lactate dehydrogenase A chain(Homo sapiens (Human))
The United States of America, As Represented By The Secretary, Department of Health and Human Services
US Patent
LigandPNGBDBM489129(2-(5- (cyclopropylmethyl)- 3-(4-fluoro-3-(p- tolyl...)
Affinity DataIC50:  26nM. Assay description: Inhibition of recombinant human LDHA using sodium pyruvate as substrate preincubated for 5 mins followed by diaphorase/resazurin addition and measure...
Ligand InfoPC cidPC sid
In DepthDetails ArticlePubMed
TargetL-lactate dehydrogenase A chain(Homo sapiens (Human))
The United States of America, As Represented By The Secretary, Department of Health and Human Services
US Patent
LigandPNGBDBM489129(2-(5- (cyclopropylmethyl)- 3-(4-fluoro-3-(p- tolyl...)
Affinity DataKd:  1.10nM. Assay description: Binding affinity to LDHA (unknown origin) by SPR analysis
Ligand InfoPC cidPC sid
In DepthDetails ArticlePubMed
TargetL-lactate dehydrogenase B chain(Homo sapiens (Human))
Vanderbilt University
Curated by ChEMBL
LigandPNGBDBM489129(2-(5- (cyclopropylmethyl)- 3-(4-fluoro-3-(p- tolyl...)
Affinity DataIC50:  1.90E+4nM. Assay description: Inhibition of recombinant human LDHB using sodium pyruvate as substrate preincubated for 5 mins followed by diaphorase/resazurin addition and measure...
Ligand InfoPC cidPC sid
In DepthDetails ArticlePubMed
TargetL-lactate dehydrogenase A chain(Homo sapiens (Human))
The United States of America, As Represented By The Secretary, Department of Health and Human Services
US Patent
LigandPNGBDBM489129(2-(5- (cyclopropylmethyl)- 3-(4-fluoro-3-(p- tolyl...)
Affinity DataIC50:  550nM. Assay description: Inhibition of LDHA in human A673 cells assessed as reduction in lactate production incubated for 2 hrs by fluorescence based assay
Ligand InfoPC cidPC sid
In DepthDetails ArticlePubMed
TargetL-lactate dehydrogenase A chain(Homo sapiens (Human))
The United States of America, As Represented By The Secretary, Department of Health and Human Services
US Patent
LigandPNGBDBM489129(2-(5- (cyclopropylmethyl)- 3-(4-fluoro-3-(p- tolyl...)
Affinity DataIC50:  870nM. Assay description: Inhibition of LDHA in human MIA PaCa2 cells assessed as reduction in lactate production incubated for 2 hrs by fluorescence based assay
Ligand InfoPC cidPC sid
In DepthDetails ArticlePubMed