BDBM489737 US10968163, Compound 4h
SMILES OC(=O)[C@H]1[C@@H]([C@@H]([C@H]1c1ccccc1Br)C(=O)OC1CCCC[C@H]1c1ccccc1)c1ccccc1Br
InChI Key InChIKey=LZAAEAPNMLXUHE-GNHAEZMHSA-N
Data  3 KI
  Tab Delimited (TSV)   2D SDfile   Computed 3D by Vconf -m prep SDfile
Find this compound or compounds like it in BindingDB:
Activity Spreadsheet -- Enzyme Inhibition Constant Data from BindingDB
Found 3 hits for monomerid = 489737
TargetFatty acid-binding protein 5(Homo sapiens (Human))
The Research Foundation For The State University of New York
US Patent
LigandPNGBDBM489737(US10968163, Compound 4h)
Affinity DataKi:  160nM. Assay description: FABP5 was purified and delipidated as described previously (Kaczocha, M. et al. 2012). FABP5 (30 μg), NBD-stearate (1 μM), and a competitor...
Ligand InfoPC cidPC sid
In DepthDetails US Patent
TargetFatty acid-binding protein, brain(Homo sapiens)
The Research Foundation For The State University of New York
US Patent
LigandPNGBDBM489737(US10968163, Compound 4h)
Affinity DataKi: >1.00E+7nM. Assay description: FABP5 was purified and delipidated as described previously (Kaczocha, M. et al. 2012). FABP5 (30 μg), NBD-stearate (1 μM), and a competitor...
Ligand InfoPC cidPC sid
In DepthDetails US Patent
TargetFatty acid-binding protein, heart(Homo sapiens (Human))
The Research Foundation For The State University of New York
US Patent
LigandPNGBDBM489737(US10968163, Compound 4h)
Affinity DataKi: >1.00E+7nM. Assay description: FABP5 was purified and delipidated as described previously (Kaczocha, M. et al. 2012). FABP5 (30 μg), NBD-stearate (1 μM), and a competitor...
Ligand InfoPC cidPC sid
In DepthDetails US Patent