BDBM50000583 2-(2-Chloro-phenyl)-6-[6-(4-hydroxy-piperidin-1-yl)-hexyloxy]-chromen-4-one::CHEMBL289767
SMILES OC1CCN(CCCCCCOc2ccc3oc(cc(=O)c3c2)-c2ccccc2Cl)CC1
InChI Key InChIKey=LLQGADIELBOEGZ-UHFFFAOYSA-N
Data  1 KI  2 IC50
  Tab Delimited (TSV)   2D SDfile   Computed 3D by Vconf -m prep SDfile
Find this compound or compounds like it in BindingDB:
Activity Spreadsheet -- Enzyme Inhibition Constant Data from BindingDB
Found 3 hits for monomerid = 50000583
TargetD(2) dopamine receptor(Rattus norvegicus (rat))
Nova Pharmaceutical
Curated by ChEMBL
LigandPNGBDBM50000583(2-(2-Chloro-phenyl)-6-[6-(4-hydroxy-piperidin-1-yl...)
Affinity DataKi:  4.10E+3nM. Assay description: Affinity towards dopamine receptor D2 site was determined by competition studies using [3H]-sulpiride in rat striatum.
In DepthDetails ArticlePubMed
TargetSigma non-opioid intracellular receptor 1(Homo sapiens (Human))
Nova Pharmaceutical
Curated by ChEMBL
LigandPNGBDBM50000583(2-(2-Chloro-phenyl)-6-[6-(4-hydroxy-piperidin-1-yl...)
Affinity DataIC50:  29nM. Assay description: Potency at the sigma binding site was determined in radioligand
In DepthDetails ArticlePubMed
TargetSigma non-opioid intracellular receptor 1(Homo sapiens (Human))
Nova Pharmaceutical
Curated by ChEMBL
LigandPNGBDBM50000583(2-(2-Chloro-phenyl)-6-[6-(4-hydroxy-piperidin-1-yl...)
Affinity DataIC50:  47nM. Assay description: Potency at the sigma binding site was determined in radioligand
In DepthDetails ArticlePubMed