BDBM50000606 2-Phenyl-6-[6-(2-pyrimidin-2-yl-piperazin-1-yl)-hexyloxy]-chromen-4-one::CHEMBL39584
SMILES O=c1cc(oc2ccc(OCCCCCCN3CCNCC3c3ncccn3)cc12)-c1ccccc1
InChI Key InChIKey=IMSBLSSUHKSGTN-UHFFFAOYSA-N
Data  1 KI  2 IC50
  Tab Delimited (TSV)   2D SDfile   Computed 3D by Vconf -m prep SDfile
Find this compound or compounds like it in BindingDB:
Activity Spreadsheet -- Enzyme Inhibition Constant Data from BindingDB
Found 3 hits for monomerid = 50000606
TargetD(2) dopamine receptor(Rattus norvegicus (rat))
Nova Pharmaceutical
Curated by ChEMBL
LigandPNGBDBM50000606(2-Phenyl-6-[6-(2-pyrimidin-2-yl-piperazin-1-yl)-he...)
Affinity DataKi:  1.30E+3nM. Assay description: Affinity towards dopamine receptor D2 was determined by competition studies using [3H]-sulpiride in rat striatum.
In DepthDetails ArticlePubMed
TargetSigma non-opioid intracellular receptor 1(Homo sapiens (Human))
Nova Pharmaceutical
Curated by ChEMBL
LigandPNGBDBM50000606(2-Phenyl-6-[6-(2-pyrimidin-2-yl-piperazin-1-yl)-he...)
Affinity DataIC50:  1.42E+4nM. Assay description: Potency at the sigma binding site was determined in radioligand
In DepthDetails ArticlePubMed
TargetSigma non-opioid intracellular receptor 1(Homo sapiens (Human))
Nova Pharmaceutical
Curated by ChEMBL
LigandPNGBDBM50000606(2-Phenyl-6-[6-(2-pyrimidin-2-yl-piperazin-1-yl)-he...)
Affinity DataIC50:  1.63E+3nM. Assay description: Potency at the sigma binding site was determined in radioligand
In DepthDetails ArticlePubMed