BDBM50000610 7-[7-(4-Hydroxy-piperidin-1-yl)-heptyloxy]-2-phenyl-chromen-4-one::CHEMBL38952
SMILES OC1CCN(CCCCCCCOc2ccc3c(c2)oc(cc3=O)-c2ccccc2)CC1
InChI Key InChIKey=WEIVNWQRFIAOTQ-UHFFFAOYSA-N
Data  1 KI  2 IC50
  Tab Delimited (TSV)   2D SDfile   Computed 3D by Vconf -m prep SDfile
Find this compound or compounds like it in BindingDB:
Activity Spreadsheet -- Enzyme Inhibition Constant Data from BindingDB
Found 3 hits for monomerid = 50000610
TargetD(2) dopamine receptor(Rattus norvegicus (rat))
Nova Pharmaceutical
Curated by ChEMBL
LigandPNGBDBM50000610(7-[7-(4-Hydroxy-piperidin-1-yl)-heptyloxy]-2-pheny...)
Affinity DataKi:  4.00E+3nM. Assay description: Affinity towards dopamine receptor D2 was determined by competition studies using [3H]-sulpiride in rat striatum.
In DepthDetails ArticlePubMed
TargetSigma non-opioid intracellular receptor 1(Homo sapiens (Human))
Nova Pharmaceutical
Curated by ChEMBL
LigandPNGBDBM50000610(7-[7-(4-Hydroxy-piperidin-1-yl)-heptyloxy]-2-pheny...)
Affinity DataIC50:  19nM. Assay description: Potency at the sigma binding site was determined in radioligand
In DepthDetails ArticlePubMed
TargetSigma non-opioid intracellular receptor 1(Homo sapiens (Human))
Nova Pharmaceutical
Curated by ChEMBL
LigandPNGBDBM50000610(7-[7-(4-Hydroxy-piperidin-1-yl)-heptyloxy]-2-pheny...)
Affinity DataIC50:  16nM. Assay description: Potency at the sigma binding site was determined in radioligand
In DepthDetails ArticlePubMed