BDBM50000628 6-(3-Dimethylamino-propoxy)-2-phenyl-chromen-4-one::CHEMBL38983
SMILES CN(C)CCCOc1ccc2oc(cc(=O)c2c1)-c1ccccc1
InChI Key InChIKey=ZYNLWVKBNSEHTK-UHFFFAOYSA-N
Data  1 KI  2 IC50
  Tab Delimited (TSV)   2D SDfile   Computed 3D by Vconf -m prep SDfile
Find this compound or compounds like it in BindingDB:
Activity Spreadsheet -- Enzyme Inhibition Constant Data from BindingDB
Found 3 hits for monomerid = 50000628
TargetD(2) dopamine receptor(Rattus norvegicus (rat))
Nova Pharmaceutical
Curated by ChEMBL
LigandPNGBDBM50000628(6-(3-Dimethylamino-propoxy)-2-phenyl-chromen-4-one...)
Affinity DataKi:  3.60E+3nM. Assay description: Affinity towards dopamine receptor D2 site was determined by competition studies using [3H]-sulpiride in rat striatum.
In DepthDetails ArticlePubMed
TargetSigma non-opioid intracellular receptor 1(Homo sapiens (Human))
Nova Pharmaceutical
Curated by ChEMBL
LigandPNGBDBM50000628(6-(3-Dimethylamino-propoxy)-2-phenyl-chromen-4-one...)
Affinity DataIC50:  257nM. Assay description: Potency at the sigma binding site was determined in radioligand
In DepthDetails ArticlePubMed
TargetSigma non-opioid intracellular receptor 1(Homo sapiens (Human))
Nova Pharmaceutical
Curated by ChEMBL
LigandPNGBDBM50000628(6-(3-Dimethylamino-propoxy)-2-phenyl-chromen-4-one...)
Affinity DataIC50:  408nM. Assay description: Potency at the sigma binding site was determined in radioligand
In DepthDetails ArticlePubMed