BDBM50000639 6-[6-(4-Hydroxy-piperidin-1-yl)-hexyloxy]-2-pyridin-3-yl-chromen-4-one::CHEMBL39203
SMILES OC1CCN(CCCCCCOc2ccc3oc(cc(=O)c3c2)-c2cccnc2)CC1
InChI Key InChIKey=GNOWCEMSRMWHRN-UHFFFAOYSA-N
Data  1 KI  2 IC50
  Tab Delimited (TSV)   2D SDfile   Computed 3D by Vconf -m prep SDfile
Find this compound or compounds like it in BindingDB:
Activity Spreadsheet -- Enzyme Inhibition Constant Data from BindingDB
Found 3 hits for monomerid = 50000639
TargetD(2) dopamine receptor(Rattus norvegicus (rat))
Nova Pharmaceutical
Curated by ChEMBL
LigandPNGBDBM50000639(6-[6-(4-Hydroxy-piperidin-1-yl)-hexyloxy]-2-pyridi...)
Affinity DataKi:  3.80E+3nM. Assay description: Affinity towards dopamine receptor D2 site was determined by competition studies using [3H]-sulpiride in rat striatum.
In DepthDetails ArticlePubMed
TargetSigma non-opioid intracellular receptor 1(Homo sapiens (Human))
Nova Pharmaceutical
Curated by ChEMBL
LigandPNGBDBM50000639(6-[6-(4-Hydroxy-piperidin-1-yl)-hexyloxy]-2-pyridi...)
Affinity DataIC50:  210nM. Assay description: Potency at the sigma binding site was determined in radioligand
In DepthDetails ArticlePubMed
TargetSigma non-opioid intracellular receptor 1(Homo sapiens (Human))
Nova Pharmaceutical
Curated by ChEMBL
LigandPNGBDBM50000639(6-[6-(4-Hydroxy-piperidin-1-yl)-hexyloxy]-2-pyridi...)
Affinity DataIC50:  194nM. Assay description: Potency at the sigma binding site was determined in radioligand
In DepthDetails ArticlePubMed