BDBM50000992 CHEMBL3235257
SMILES C[C@@H]1CC[C@H](CN1C(=O)c1cc(C)ccc1-n1nccn1)C#Cc1cccnc1O
InChI Key InChIKey=KTCAYZHHVZLYIZ-MSOLQXFVSA-N
Data  2 KI
  Tab Delimited (TSV)   2D SDfile   Computed 3D by Vconf -m prep SDfile
Find this compound or compounds like it in BindingDB:
Activity Spreadsheet -- Enzyme Inhibition Constant Data from BindingDB
Found 2 hits for monomerid = 50000992
TargetOrexin/Hypocretin receptor type 1(Homo sapiens (Human))
Merck Research Laboratories
Curated by ChEMBL
LigandPNGBDBM50000992(CHEMBL3235257)
Affinity DataKi:  24nM. Assay description: Binding affinity to human OX1 receptor in cell membrane by in vitro radioligand binding assay
In DepthDetails ArticlePubMed
TargetOrexin receptor type 2(Homo sapiens (Human))
Merck Research Laboratories
Curated by ChEMBL
LigandPNGBDBM50000992(CHEMBL3235257)
Affinity DataKi:  24nM. Assay description: Binding affinity to human OX2 receptor in cell membrane by in vitro radioligand binding assay
In DepthDetails ArticlePubMed