BDBM50001771 1-(2-{4-[1-(4-Fluoro-phenyl)-6-trifluoromethyl-1H-indol-3-yl]-piperidin-1-yl}-ethyl)-imidazolidin-2-one::CHEMBL341669
SMILES Fc1ccc(cc1)-n1cc(C2CCN(CCN3CCNC3=O)CC2)c2ccc(cc12)C(F)(F)F
InChI Key InChIKey=OIEXLUYLHWCBJN-UHFFFAOYSA-N
Data  3 IC50
  Tab Delimited (TSV)   2D SDfile   Computed 3D by Vconf -m prep SDfile
Find this compound or compounds like it in BindingDB:
Activity Spreadsheet -- Enzyme Inhibition Constant Data from BindingDB
Found 3 hits for monomerid = 50001771
TargetD(2) dopamine receptor(Rattus norvegicus (rat))
H. Lundbeck
Curated by ChEMBL
LigandPNGBDBM50001771(1-(2-{4-[1-(4-Fluoro-phenyl)-6-trifluoromethyl-1H-...)
Affinity DataIC50:  260nM. Assay description: Displacement of [3H]-spiperone from Dopamine receptor D2 from rat striatal membranes
In DepthDetails ArticlePubMed
TargetSerotonin 2 (5-HT2) receptor(RAT)
H. Lundbeck
Curated by ChEMBL
LigandPNGBDBM50001771(1-(2-{4-[1-(4-Fluoro-phenyl)-6-trifluoromethyl-1H-...)
Affinity DataIC50:  1.70nM. Assay description: Displacement of [3H]ketanserin from 5-hydroxytryptamine 2 receptor from rat cortical membranes.
In DepthDetails ArticlePubMed
TargetAlpha-1A/Alpha-1B/Alpha-1D adrenergic receptor(Rattus norvegicus (rat))
H. Lundbeck
Curated by ChEMBL
LigandPNGBDBM50001771(1-(2-{4-[1-(4-Fluoro-phenyl)-6-trifluoromethyl-1H-...)
Affinity DataIC50:  33nM. Assay description: Displacement of [3H]prazosin from Alpha-1 adrenergic receptor of whole rat brain membranes
In DepthDetails ArticlePubMed