BDBM50002293 4-(4-Chloro-phenoxymethyl)-1-cyclopropylmethyl-piperidine; hydrochloride::CHEMBL539302
SMILES Clc1ccc(OCC2CCN(CC3CC3)CC2)cc1
InChI Key InChIKey=SQRXAJRZEFTEFS-UHFFFAOYSA-N
Data  2 KI  1 IC50
  Tab Delimited (TSV)   2D SDfile   Computed 3D by Vconf -m prep SDfile
Find this compound or compounds like it in BindingDB:
Activity Spreadsheet -- Enzyme Inhibition Constant Data from BindingDB
Found 3 hits for monomerid = 50002293
TargetSigma non-opioid intracellular receptor 1(Mus musculus (Mouse))
Dupont Pharmaceuticals
Curated by ChEMBL
LigandPNGBDBM50002293(4-(4-Chloro-phenoxymethyl)-1-cyclopropylmethyl-pip...)
Affinity DataKi:  4nM. Assay description: In vitro binding affinity for the mouse sigma opioid receptor
In DepthDetails ArticlePubMed
Target5-hydroxytryptamine receptor 2A/2B/2C(Mus musculus (Mouse))
Dupont Pharmaceuticals
Curated by ChEMBL
LigandPNGBDBM50002293(4-(4-Chloro-phenoxymethyl)-1-cyclopropylmethyl-pip...)
Affinity DataKi:  40nM. Assay description: In vitro binding affinity for serotonin 5-hydroxytryptamine (5-HT) 2 receptors
In DepthDetails ArticlePubMed
TargetD(2) dopamine receptor(Mus musculus (Mouse))
Dupont Pharmaceuticals
Curated by ChEMBL
LigandPNGBDBM50002293(4-(4-Chloro-phenoxymethyl)-1-cyclopropylmethyl-pip...)
Affinity DataIC50: >1.00E+4nM. Assay description: In vitro binding affinity towards dopamine receptor D2
In DepthDetails ArticlePubMed