BDBM50002301 4-(4-Fluoro-benzyloxymethyl)-1-naphthalen-1-ylmethyl-piperidine; hydrochloride::CHEMBL545552
SMILES Fc1ccc(COCC2CCN(Cc3cccc4ccccc34)CC2)cc1
InChI Key InChIKey=CCVCUCIRQWESOG-UHFFFAOYSA-N
Data  2 KI  1 IC50
  Tab Delimited (TSV)   2D SDfile   Computed 3D by Vconf -m prep SDfile
Find this compound or compounds like it in BindingDB:
Activity Spreadsheet -- Enzyme Inhibition Constant Data from BindingDB
Found 3 hits for monomerid = 50002301
TargetSigma non-opioid intracellular receptor 1(Mus musculus (Mouse))
Dupont Pharmaceuticals
Curated by ChEMBL
LigandPNGBDBM50002301(4-(4-Fluoro-benzyloxymethyl)-1-naphthalen-1-ylmeth...)
Affinity DataKi:  22nM. Assay description: In vitro binding affinity for the mouse sigma opioid receptor
In DepthDetails ArticlePubMed
Target5-hydroxytryptamine receptor 2A/2B/2C(Mus musculus (Mouse))
Dupont Pharmaceuticals
Curated by ChEMBL
LigandPNGBDBM50002301(4-(4-Fluoro-benzyloxymethyl)-1-naphthalen-1-ylmeth...)
Affinity DataKi:  25nM. Assay description: In vitro binding affinity for serotonin 5-hydroxytryptamine (5-HT) 2 receptors
In DepthDetails ArticlePubMed
TargetD(2) dopamine receptor(Mus musculus (Mouse))
Dupont Pharmaceuticals
Curated by ChEMBL
LigandPNGBDBM50002301(4-(4-Fluoro-benzyloxymethyl)-1-naphthalen-1-ylmeth...)
Affinity DataIC50:  219nM. Assay description: In vitro binding affinity towards dopamine receptor D2
In DepthDetails ArticlePubMed