BDBM50002424 CHEMBL371983
SMILES CC(C)C[C@H]1N([C@@H](C(=O)NC(C)(C)C)c2cccc(c2)N2CCN(C)CC2)C(=O)[C@H](NC1=O)C1Cc2ccccc2C1
InChI Key InChIKey=FRIVMVVGIHXEKK-IDZRBWSNSA-N
Data  1 KI
  Tab Delimited (TSV)   2D SDfile   Computed 3D by Vconf -m prep SDfile
Find this compound or compounds like it in BindingDB:
Activity Spreadsheet -- Enzyme Inhibition Constant Data from BindingDB
Found 1 hit for monomerid = 50002424
TargetOxytocin receptor(Homo sapiens (Human))
Glaxosmithkline
Curated by ChEMBL
LigandPNGBDBM50002424(CHEMBL371983)
Affinity DataKi:  158nM. Assay description: Displacement of [3H]oxytocin from human Oxytocin receptorChecked by Author
In DepthDetails ArticlePubMed