BDBM50003013 CHEMBL401270
SMILES CC1(C)CC(=O)c2cc(C#N)c(nc2C1)N1CCC(=CC1)c1ccccc1
InChI Key InChIKey=AIYWZWORQFMZPU-UHFFFAOYSA-N
Data  1 IC50
  Tab Delimited (TSV)   2D SDfile   Computed 3D by Vconf -m prep SDfile
Find this compound or compounds like it in BindingDB:
Activity Spreadsheet -- Enzyme Inhibition Constant Data from BindingDB
Found 1 hit for monomerid = 50003013
TargetMetabotropic glutamate receptor 1(RAT)
Institute Of Organic Synthesis
Curated by ChEMBL
LigandPNGBDBM50003013(CHEMBL401270)
Affinity DataIC50: <1.00E+3nM. Assay description: Antagonist activity at rat mGluR1 expressed in cerebellar granule cells assessed as accumulation of [3H]inositol phosphate
In DepthDetails ArticlePubMed