BDBM50003530 CHEMBL340989::N-{2-[4-(Cyano-pyridin-4-yl-methyl)-piperazin-1-yl]-2-oxo-ethyl}-2,2-diphenyl-acetamide
SMILES O=C(CNC(=O)C(c1ccccc1)c1ccccc1)N1CCN(CC1)C(C#N)c1ccncc1
InChI Key InChIKey=IPOCEWGZFJGJBN-UHFFFAOYSA-N
Data  1 IC50
  Tab Delimited (TSV)   2D SDfile   Computed 3D by Vconf -m prep SDfile
Find this compound or compounds like it in BindingDB:
Activity Spreadsheet -- Enzyme Inhibition Constant Data from BindingDB
Found 1 hit for monomerid = 50003530
TargetPlatelet-activating factor receptor(Cavia porcellus)
J. Uriach & C£A.S.A.
Curated by ChEMBL
LigandPNGBDBM50003530(CHEMBL340989 | N-{2-[4-(Cyano-pyridin-4-yl-methyl)...)
Affinity DataIC50:  680nM. Assay description: Concentration tested in vitro to inhibit PAF-induced maximum aggregation (PAF-Antagonistic activity) by 50%.
In DepthDetails ArticlePubMed