BDBM50003701 CHEMBL3234954
SMILES Nc1nc(SCc2csc(n2)-c2ccc(Br)cc2)nc(-c2ccc3OCOc3c2)c1C#N
InChI Key InChIKey=OONFVULEGKOWQT-UHFFFAOYSA-N
Data  1 KI  1 EC50
  Tab Delimited (TSV)   2D SDfile   Computed 3D by Vconf -m prep SDfile
Find this compound or compounds like it in BindingDB:
Activity Spreadsheet -- Enzyme Inhibition Constant Data from BindingDB
Found 2 hits for monomerid = 50003701
TargetAdenosine receptor A1(Homo sapiens (Human))
Leiden University
Curated by ChEMBL
LigandPNGBDBM50003701(CHEMBL3234954)
Affinity DataKi:  5.20nM. Assay description: Displacement of [3H]DPCPX from human adenosine A1 receptor expressed in CHO cell membranes after 1 hr by beta scintillation counting analysis
In DepthDetails ArticlePubMed
TargetAdenosine receptor A1(Homo sapiens (Human))
Leiden University
Curated by ChEMBL
LigandPNGBDBM50003701(CHEMBL3234954)
Affinity DataEC50:  4.60nM. Assay description: Agonist activity human adenosine A1 receptor expressed in CHO cell membranes assessed as stimulation of [35S]GTPgammaS binding preincubated for 30 mi...
In DepthDetails ArticlePubMed