BDBM50004056 (S)-3-[4-(8-Amino-octyloxy)-phenyl]-2-benzyloxycarbonylamino-propionic acid::3-[4-(8-Amino-octyloxy)-phenyl]-2-benzyloxycarbonylamino-propionic acid::CHEMBL85268
SMILES NCCCCCCCCOc1ccc(C[C@H](NC(=O)OCc2ccccc2)C(O)=O)cc1
InChI Key InChIKey=JFPPNMCJDHWZDM-QHCPKHFHSA-N
Data  2 IC50
  Tab Delimited (TSV)   2D SDfile   Computed 3D by Vconf -m prep SDfile
Find this compound or compounds like it in BindingDB:
Activity Spreadsheet -- Enzyme Inhibition Constant Data from BindingDB
Found 2 hits for monomerid = 50004056
TargetIntegrin alpha-IIb/beta-3(Homo sapiens (Human))
Merck Research Laboratories
Curated by ChEMBL
LigandPNGBDBM50004056((S)-3-[4-(8-Amino-octyloxy)-phenyl]-2-benzyloxycar...)
Affinity DataIC50:  4.00E+4nM. Assay description: In vitro inhibition of ADP-mediated human gel filtered platelet aggregation.
In DepthDetails ArticlePubMed
TargetIntegrin alpha-IIb/beta-3(Homo sapiens (Human))
Merck Research Laboratories
Curated by ChEMBL
LigandPNGBDBM50004056((S)-3-[4-(8-Amino-octyloxy)-phenyl]-2-benzyloxycar...)
Affinity DataIC50:  3.80E+4nM. Assay description: Inhibition of platelet aggregation as the concentration necessary to inhibit the change in light .
In DepthDetails ArticlePubMed