BDBM50004208 CHEMBL3237173
SMILES COC(=O)c1ccc(Nc2nc(Nc3cc(C)[nH]n3)cc(n2)N2CCNCC2)cc1
InChI Key InChIKey=NKTDXYYRTOEURO-UHFFFAOYSA-N
Data  1 IC50
  Tab Delimited (TSV)   2D SDfile   Computed 3D by Vconf -m prep SDfile
Find this compound or compounds like it in BindingDB:
Activity Spreadsheet -- Enzyme Inhibition Constant Data from BindingDB
Found 1 hit for monomerid = 50004208
TargetAurora kinase A(Homo sapiens (Human))
Sun Yat-Sen University
Curated by ChEMBL
LigandPNGBDBM50004208(CHEMBL3237173)
Affinity DataIC50:  135nM. Assay description: Inhibition of Aurora A (unknown origin) using FAM-labeled peptide as substrate preincubated for 10 mins followed by substrate addition measured after...
In DepthDetails ArticlePubMed