BDBM50004229 CHEMBL3237165
SMILES CN1CCN(CC1)c1cc(Nc2cc(C)[nH]n2)nc(Nc2cccc(c2)[N+]([O-])=O)n1
InChI Key InChIKey=HNGRAFLHXDDWDJ-UHFFFAOYSA-N
Data  1 IC50
  Tab Delimited (TSV)   2D SDfile   Computed 3D by Vconf -m prep SDfile
Find this compound or compounds like it in BindingDB:
Activity Spreadsheet -- Enzyme Inhibition Constant Data from BindingDB
Found 1 hit for monomerid = 50004229
TargetAurora kinase A(Homo sapiens (Human))
Sun Yat-Sen University
Curated by ChEMBL
LigandPNGBDBM50004229(CHEMBL3237165)
Affinity DataIC50:  16nM. Assay description: Inhibition of Aurora A (unknown origin) using FAM-labeled peptide as substrate preincubated for 10 mins followed by substrate addition measured after...
In DepthDetails ArticlePubMed