BDBM50005304 4-Cyclohexyl-2-hydroxy-3-{4-methyl-2-[2-(5-oxo-5,7-dihydro-pyrrolo[3,4-b]pyridin-6-yl)-3-phenyl-propionylamino]-pentanoylamino}-butyric acid methyl ester::CHEMBL353306
SMILES COC(=O)C(O)[C@H](CC1CCCCC1)NC(=O)C(CC(C)C)NC(=O)[C@H](Cc1ccccc1)n1cc2[nH]cccc2c1=O
InChI Key InChIKey=JTKRFZINMFPROJ-DZUIKGQPSA-N
Data  1 IC50
  Tab Delimited (TSV)   2D SDfile   Computed 3D by Vconf -m prep SDfile
Find this compound or compounds like it in BindingDB:
Activity Spreadsheet -- Enzyme Inhibition Constant Data from BindingDB
Found 1 hit for monomerid = 50005304
TargetRenin(Homo sapiens (Human))
Wyeth-Ayerst Research
Curated by ChEMBL
LigandPNGBDBM50005304(4-Cyclohexyl-2-hydroxy-3-{4-methyl-2-[2-(5-oxo-5,7...)
Affinity DataIC50:  207nM. Assay description: Inhibition of human recombinant renin
In DepthDetails ArticlePubMed