BDBM50005437 CHEMBL8477::N-[Allylsulfanyl-(1-cyclohexylmethyl-2,3-dihydroxy-5-methyl-hexylcarbamoyl)-methyl]-2-(morpholine-4-sulfonylamino)-3-phenyl-propionamide
SMILES CC(C)C[C@H](O)[C@H](O)[C@H](CC1CCCCC1)NC(=O)C(NC(=O)[C@H](Cc1ccccc1)NS(=O)(=O)N1CCOCC1)SCC=C
InChI Key InChIKey=ZPQDRLPJUKSWIJ-GDZMZIAQSA-N
Data  2 IC50
  Tab Delimited (TSV)   2D SDfile   Computed 3D by Vconf -m prep SDfile
Find this compound or compounds like it in BindingDB:
Activity Spreadsheet -- Enzyme Inhibition Constant Data from BindingDB
Found 1 hit for monomerid = 50005437
TargetRenin(Homo sapiens (Human))
Warner-Lambert
Curated by ChEMBL
LigandPNGBDBM50005437(CHEMBL8477 | N-[Allylsulfanyl-(1-cyclohexylmethyl-...)
Affinity DataIC50:  0.170nM. Assay description: Inhibitory activity against monkey renin in vitro.
In DepthDetails ArticlePubMed