BDBM50006140 2-[2-(4-Allyloxy-piperidin-1-yl)-1-benzyl-2-oxo-ethoxy]-hexanoic acid (1-cyclohexylmethyl-2,3-dihydroxy-5-methyl-hexyl)-amide::CHEMBL50054
SMILES CCCC[C@H](O[C@@H](Cc1ccccc1)C(=O)N1CCC(CC1)OCC=C)C(=O)N[C@@H](CC1CCCCC1)[C@@H](O)[C@@H](O)CC(C)C
InChI Key InChIKey=AMQZJHQSASWTKL-PRTBYXSSSA-N
Data  1 IC50
  Tab Delimited (TSV)   2D SDfile   Computed 3D by Vconf -m prep SDfile
Find this compound or compounds like it in BindingDB:
Activity Spreadsheet -- Enzyme Inhibition Constant Data from BindingDB
Found 1 hit for monomerid = 50006140
TargetRenin(Homo sapiens (Human))
Abbott Laboratories
Curated by ChEMBL
LigandPNGBDBM50006140(2-[2-(4-Allyloxy-piperidin-1-yl)-1-benzyl-2-oxo-et...)
Affinity DataIC50:  160nMpH: 7.4Assay Description:In vitro potency against purified renin at a pH of 6.0.
In DepthDetails ArticlePubMed